Reaction Details
TargetBeta-1 adrenergic receptor
LigandBDBM50418940
Substrate/Competitorn/a
Meas. Tech.ChEMBL_759387 (CHEMBL1810625)
IC50 126±n/a nM
Citation Connolly, SAlcaraz, LBailey, ACadogan, EChristie, JCook, ARFisher, AJHill, SHumphries, AIngall, AHKane, ZPaine, SPairaudeau, GStocks, MJYoung, A Design-driven LO: the discovery of new ultra long acting dibasicß2-adrenoceptor agonists. Bioorg Med Chem Lett21:4612-6 (2011) 
 
Beta-1 adrenergic receptor
Name:Beta-1 adrenergic receptor
Type:G Protein-Coupled Receptor (GPCR)
Mol. Mass.:51338.40
Organism:Homo sapiens (Human)
Description:P08588
Residue:477
BDBM50418940
NameBDBM50418940
Synonyms:CHEMBL1807825
TypeSmall organic molecule
Emp. Form.C24H33N3O4S2
Mol. Mass.491.667
SMILESCCOc1ccc(CCNCCCSCCNC[C@H](O)c2ccc(O)c3[nH]c(=O)sc23)cc1