Reaction Details
TargetBeta-2 adrenergic receptor
LigandBDBM25771
Substrate/Competitorn/a
Meas. Tech.ChEMBL_761250 (CHEMBL1816608)
EC50 0.251189±n/a nM
Citation Procopiou, PABarrett, VJBevan, NJButchers, PRConroy, REmmons, AFord, AJJeulin, SLooker, BELunniss, GEMorrison, VSMutch, PJPerciaccante, RRuston, MSmith, CESomers, G The discovery of long-acting saligeninß2 adrenergic receptor agonists incorporating hydantoin or uracil rings. Bioorg Med Chem19:4192-201 (2011) 
 
Beta-2 adrenergic receptor
Name:Beta-2 adrenergic receptor
Type:n/a
Mol. Mass.:46461.69
Organism:Homo sapiens (Human)
Description:P07550
Residue:413
BDBM25771
NameBDBM25771
Synonyms:1-hydroxy-2-naphthoic acid;4-[1-hydroxy-2-[6-(4-phenylbutoxy)hexylamino]ethyl]-2-methylol-phenol Aeromax Serevent | salmeterol xinafoate
TypeSmall organic molecule
Emp. Form.C25H37NO4
Mol. Mass.415.5656
SMILESOCc1cc(ccc1O)C(O)CNCCCCCCOCCCCc1ccccc1