Reaction Details
TargetfMet-Leu-Phe receptor
LigandBDBM50419566
Substrate/Competitorn/a
Meas. Tech.ChEMBL_796441 (CHEMBL1937756)
IC50 316±n/a nM
Citation Morley, ADKing, SRoberts, BLever, STeobald, BFisher, ACook, TParker, BWenlock, MPhillips, CGrime, K Lead optimisation of pyrazoles as novel FPR1 antagonists. Bioorg Med Chem Lett22:532-6 (2011) 
 
fMet-Leu-Phe receptor
Name:fMet-Leu-Phe receptor
Type:Enzyme Catalytic Domain
Mol. Mass.:38456.14
Organism:Homo sapiens (Human)
Description:gi_4503779
Residue:350
BDBM50419566
NameBDBM50419566
Synonyms:CHEMBL1934417
TypeSmall organic molecule
Emp. Form.C23H36N4O4S
Mol. Mass.464.621
SMILESCOCCC(C)n1nc(C)c(C(=O)N[C@@H](C)C(C)(C)C)c1NS(=O)(=O)c1ccc(C)cc1