Reaction Details
TargetfMet-Leu-Phe receptor
LigandBDBM50419568
Substrate/Competitorn/a
Meas. Tech.ChEMBL_796441 (CHEMBL1937756)
IC50 32±n/a nM
Citation Morley, ADKing, SRoberts, BLever, STeobald, BFisher, ACook, TParker, BWenlock, MPhillips, CGrime, K Lead optimisation of pyrazoles as novel FPR1 antagonists. Bioorg Med Chem Lett22:532-6 (2011) 
 
fMet-Leu-Phe receptor
Name:fMet-Leu-Phe receptor
Type:Enzyme Catalytic Domain
Mol. Mass.:38456.14
Organism:Homo sapiens (Human)
Description:gi_4503779
Residue:350
BDBM50419568
NameBDBM50419568
Synonyms:CHEMBL1934415
TypeSmall organic molecule
Emp. Form.C24H36N4O3S
Mol. Mass.460.633
SMILESC[C@H](NC(=O)c1c(C)nn(C2CCCCC2)c1NS(=O)(=O)c1ccc(C)cc1)C(C)(C)C