Reaction Details
TargetHistamine H3 receptor
LigandBDBM50419581
Substrate/Competitorn/a
Meas. Tech.ChEMBL_795214 (CHEMBL1936782)
Ki 2.04±n/a nM
Citation Bordi, FRivara, SDallaturca, ECarmi, CPala, DLodola, AVacondio, FFlammini, LBertoni, SBallabeni, VBarocelli, EMor, M Dibasic biphenyl H3 receptor antagonists: Steric tolerance for a lipophilic side chain. Eur J Med Chem48:214-30 (2012) 
 
Histamine H3 receptor
Name:Histamine H3 receptor
Type:G Protein-Coupled Receptor (GPCR)
Mol. Mass.:48691.47
Organism:Homo sapiens (Human)
Description:Binding assays were using CHO cells stably expressing hH3R receptors.
Residue:445
BDBM50419581
NameBDBM50419581
Synonyms:CHEMBL1934065
TypeSmall organic molecule
Emp. Form.C34H44N2O2
Mol. Mass.512.7254
SMILESCOc1ccc(OCCC[C@H](N2CCC[C@@H]2C)c2ccc(cc2)-c2ccc(CN3CCCCC3)cc2)cc1