Reaction Details
TargetBeta-2 adrenergic receptor
LigandBDBM25769
Substrate/Competitorn/a
Meas. Tech.ChEMBL_797650 (CHEMBL1943768)
EC50 25±n/a nM
Citation Jacobsen, JRChoi, SKCombs, JFournier, EJKlein, UPfeiffer, JWThomas, GRYu, CMoran, EJ A multivalent approach to the discovery of long-actingß(2)-adrenoceptor agonists for the treatment of asthma and COPD. Bioorg Med Chem Lett22:1213-8 (2012) 
 
Beta-2 adrenergic receptor
Name:Beta-2 adrenergic receptor
Type:n/a
Mol. Mass.:46461.69
Organism:Homo sapiens (Human)
Description:P07550
Residue:413
BDBM25769
NameBDBM25769
Synonyms:4-[2-(tert-butylamino)-1-hydroxyethyl]-2-(hydroxymethyl)phenol Proventil Salbutamol,(+/-) | albuterol
TypeSmall organic molecule
Emp. Form.C13H21NO3
Mol. Mass.239.3107
SMILESCC(C)(C)NCC(O)c1ccc(O)c(CO)c1