Reaction Details
TargetAlpha-1A adrenergic receptor
LigandBDBM50419722
Substrate/Competitorn/a
Meas. Tech.ChEMBL_800453 (CHEMBL1948474)
Ki 26.92±n/a nM
Citation Prandi, AFranchini, SManasieva, LIFossa, PCichero, EMarucci, GBuccioni, MCilia, APirona, LBrasili, L Synthesis, biological evaluation, and docking studies of tetrahydrofuran- cyclopentanone- and cyclopentanol-based ligands acting at adrenergica1- and serotonine 5-HT1A receptors. J Med Chem55:23-36 (2012) 
 
Alpha-1A adrenergic receptor
Name:Alpha-1A adrenergic receptor
Type:Cell-surface receptors
Mol. Mass.:51511.67
Organism:Homo sapiens (Human)
Description:P35348
Residue:466
BDBM50419722
NameBDBM50419722
Synonyms:CHEMBL1946779
TypeSmall organic molecule
Emp. Form.C26H29NO3
Mol. Mass.403.5134
SMILESCOc1ccccc1OCCNCC1CCC(O1)(c1ccccc1)c1ccccc1