Reaction Details
TargetAlpha-1A adrenergic receptor
LigandBDBM86708
Substrate/Competitorn/a
Meas. Tech.ChEMBL_800453 (CHEMBL1948474)
Ki 18.62±n/a nM
Citation Prandi, AFranchini, SManasieva, LIFossa, PCichero, EMarucci, GBuccioni, MCilia, APirona, LBrasili, L Synthesis, biological evaluation, and docking studies of tetrahydrofuran- cyclopentanone- and cyclopentanol-based ligands acting at adrenergica1- and serotonine 5-HT1A receptors. J Med Chem55:23-36 (2012) 
 
Alpha-1A adrenergic receptor
Name:Alpha-1A adrenergic receptor
Type:Cell-surface receptors
Mol. Mass.:51511.67
Organism:Homo sapiens (Human)
Description:P35348
Residue:466
BDBM86708
NameBDBM86708
Synonyms:CAS_146714-97-8 CHEMBL514874 NSC_104911 | WAY 100,635
TypeSmall organic molecule
Emp. Form.C25H34N4O2
Mol. Mass.422.5631
SMILESCOc1ccccc1N1CCN(CCN(C(=O)C2CCCCC2)c2ccccn2)CC1