Reaction Details
TargetAlpha-1B adrenergic receptor
LigandBDBM50409811
Substrate/Competitorn/a
Meas. Tech.ChEMBL_800454 (CHEMBL1948475)
Ki 46.77±n/a nM
Citation Prandi, AFranchini, SManasieva, LIFossa, PCichero, EMarucci, GBuccioni, MCilia, APirona, LBrasili, L Synthesis, biological evaluation, and docking studies of tetrahydrofuran- cyclopentanone- and cyclopentanol-based ligands acting at adrenergica1- and serotonine 5-HT1A receptors. J Med Chem55:23-36 (2012) 
 
Alpha-1B adrenergic receptor
Name:Alpha-1B adrenergic receptor
Type:Enzyme
Mol. Mass.:56862.13
Organism:Homo sapiens (Human)
Description:P35368
Residue:520
BDBM50409811
NameBDBM50409811
Synonyms:CHEMBL1082862 | CHEMBL286003
TypeSmall organic molecule
Emp. Form.C25H27NO4
Mol. Mass.405.4862
SMILESCOc1ccccc1OCCNCC1COC(O1)(c1ccccc1)c1ccccc1