Reaction Details
TargetAlpha-1D adrenergic receptor
LigandBDBM50419722
Substrate/Competitorn/a
Meas. Tech.ChEMBL_800455 (CHEMBL1948476)
Ki 6.31±n/a nM
Citation Prandi, AFranchini, SManasieva, LIFossa, PCichero, EMarucci, GBuccioni, MCilia, APirona, LBrasili, L Synthesis, biological evaluation, and docking studies of tetrahydrofuran- cyclopentanone- and cyclopentanol-based ligands acting at adrenergica1- and serotonine 5-HT1A receptors. J Med Chem55:23-36 (2012) 
 
Alpha-1D adrenergic receptor
Name:Alpha-1D adrenergic receptor
Type:Enzyme Catalytic Domain
Mol. Mass.:60485.82
Organism:Homo sapiens (Human)
Description:adrenergic Alpha1D ADRA1D HUMAN::P25100
Residue:572
BDBM50419722
NameBDBM50419722
Synonyms:CHEMBL1946779
TypeSmall organic molecule
Emp. Form.C26H29NO3
Mol. Mass.403.5134
SMILESCOc1ccccc1OCCNCC1CCC(O1)(c1ccccc1)c1ccccc1