Reaction Details
TargetAlpha-1B adrenergic receptor
LigandBDBM50419716
Substrate/Competitorn/a
Meas. Tech.ChEMBL_800454 (CHEMBL1948475)
Ki 6.76±n/a nM
Citation Prandi, AFranchini, SManasieva, LIFossa, PCichero, EMarucci, GBuccioni, MCilia, APirona, LBrasili, L Synthesis, biological evaluation, and docking studies of tetrahydrofuran- cyclopentanone- and cyclopentanol-based ligands acting at adrenergica1- and serotonine 5-HT1A receptors. J Med Chem55:23-36 (2012) 
 
Alpha-1B adrenergic receptor
Name:Alpha-1B adrenergic receptor
Type:Enzyme
Mol. Mass.:56862.13
Organism:Homo sapiens (Human)
Description:P35368
Residue:520
BDBM50419716
NameBDBM50419716
Synonyms:CHEMBL1946777
TypeSmall organic molecule
Emp. Form.C27H30N2O3
Mol. Mass.430.5387
SMILESCOc1ccccc1N1CCN(CC2COC(O2)(c2ccccc2)c2ccccc2)CC1