Reaction Details
TargetNeuronal acetylcholine receptor subunit alpha-4/beta-2
LigandBDBM50419796
Substrate/Competitorn/a
Meas. Tech.ChEMBL_804324 (CHEMBL1954620)
IC50 4168.69±n/a nM
Citation Henderson, BJOrac, CMMaciagiewicz, IBergmeier, SCMcKay, DB 3D-QSAR and 3D-QSSR models of negative allosteric modulators facilitate the design of a novel selective antagonist of humana4ß2 neuronal nicotinic acetylcholine receptors. Bioorg Med Chem Lett22:1797-813 (2012) 
 
Neuronal acetylcholine receptor subunit alpha-4/beta-2
Name:Neuronal acetylcholine receptor subunit alpha-4/beta-2
Type:Protein
Mol. Mass.:n/a
Description:n/a
Components:This complex has 2 components.
Component 1
Name:Neuronal acetylcholine receptor subunit alpha-4
Synonyms:ACHA4_HUMAN CHRNA4 protein Neuronal acetylcholine receptor protein alpha-4 subunit Nicotinic acetylcholine receptor alpha4/beta2/alpha5
Type:n/a
Mol. Mass.:69963.49
Organism:Homo sapiens (Human)
Description:NACHRA4
Residue:627
Component 2
Name:Neuronal acetylcholine receptor subunit beta-2
Synonyms:ACHB2_HUMAN Neuronal acetylcholine receptor protein beta-2 subunit | Nicotinic acetylcholine receptor alpha3/beta2/alpha5
Type:Protein
Mol. Mass.:57020.50
Organism:Homo sapiens (Human)
Description:P17787
Residue:502
BDBM50419796
NameBDBM50419796
Synonyms:CHEMBL1950614
TypeSmall organic molecule
Emp. Form.C19H23NO
Mol. Mass.281.392
SMILESC(OCc1ccccc1-c1ccccc1)C1CCCNC1