Reaction Details
TargetNeuronal acetylcholine receptor subunit alpha-4/beta-2
LigandBDBM50419815
Substrate/Competitorn/a
Meas. Tech.ChEMBL_804324 (CHEMBL1954620)
IC50 5600±n/a nM
Citation Henderson, BJOrac, CMMaciagiewicz, IBergmeier, SCMcKay, DB 3D-QSAR and 3D-QSSR models of negative allosteric modulators facilitate the design of a novel selective antagonist of humana4ß2 neuronal nicotinic acetylcholine receptors. Bioorg Med Chem Lett22:1797-813 (2012) 
 
Neuronal acetylcholine receptor subunit alpha-4/beta-2
Name:Neuronal acetylcholine receptor subunit alpha-4/beta-2
Type:Protein
Mol. Mass.:n/a
Description:n/a
Components:This complex has 2 components.
Component 1
Name:Neuronal acetylcholine receptor subunit alpha-4
Synonyms:ACHA4_HUMAN CHRNA4 protein Neuronal acetylcholine receptor protein alpha-4 subunit Nicotinic acetylcholine receptor alpha4/beta2/alpha5
Type:n/a
Mol. Mass.:69963.49
Organism:Homo sapiens (Human)
Description:NACHRA4
Residue:627
Component 2
Name:Neuronal acetylcholine receptor subunit beta-2
Synonyms:ACHB2_HUMAN Neuronal acetylcholine receptor protein beta-2 subunit | Nicotinic acetylcholine receptor alpha3/beta2/alpha5
Type:Protein
Mol. Mass.:57020.50
Organism:Homo sapiens (Human)
Description:P17787
Residue:502
BDBM50419815
NameBDBM50419815
Synonyms:CHEMBL1950636
TypeSmall organic molecule
Emp. Form.C28H29NO3
Mol. Mass.427.5348
SMILESO=C(CCc1ccccc1)N1CCCC(COC(=O)c2ccccc2-c2ccccc2)C1