Reaction Details
TargetAlpha-2A adrenergic receptor
LigandBDBM50019646
Substrate/Competitorn/a
Meas. Tech.ChEMBL_805961 (CHEMBL1960289)
EC50 6.3±n/a nM
Citation Diamanti, EDel Bello, FCarbonara, GCarrieri, AFracchiolla, GGiannella, MMammoli, VPiergentili, APohjanoksa, KQuaglia, WScheinin, MPigini, M Might the observeda(2A)-adrenoreceptor agonism or antagonism of allyphenyline analogues be ascribed to different molecular conformations? Bioorg Med Chem20:2082-90 (2012) 
 
Alpha-2A adrenergic receptor
Name:Alpha-2A adrenergic receptor
Type:Enzyme
Mol. Mass.:48979.91
Organism:Homo sapiens (Human)
Description:P08913
Residue:465
BDBM50019646
NameBDBM50019646
Synonyms:2-(alpha-(2,6-Dichlorophenoxy)ethyl)2-imidazoline CHEMBL17860 | lofexidine
TypeSmall organic molecule
Emp. Form.C11H12Cl2N2O
Mol. Mass.259.132
SMILESCC(Oc1c(Cl)cccc1Cl)C1=NCCN1