Reaction Details
TargetB2 bradykinin receptor
LigandBDBM50411275
Substrate/Competitorn/a
Meas. Tech.ChEMBL_806222 (CHEMBL1958763)
Kd 0.0501±n/a nM
Citation Fincham, CIBressan, AD'Andrea, PEttorre, AGiuliani, SMauro, SMeini, SParis, MQuartara, LRossi, CSquarcia, AValenti, CDaniela, FMaggi, CA Design and synthesis of novel sulfonamide-containing bradykinin hB(2) receptor antagonists. Synthesis and structure-relationships ofa,a-tetrahydropyranylglycine. Bioorg Med Chem20:2091-100 (2012) 
 
B2 bradykinin receptor
Name:B2 bradykinin receptor
Type:Enzyme Catalytic Domain
Mol. Mass.:44467.17
Organism:Homo sapiens (Human)
Description:B2 BRADYKININ BDKRB2 HUMAN::P30411
Residue:391
BDBM50411275
NameBDBM50411275
Synonyms:CHEMBL218427 | MEN-16132
TypeSmall organic molecule
Emp. Form.C36H49Cl2N6O6S
Mol. Mass.764.781
SMILESCc1cc(C)c2cccc(OCc3c(Cl)ccc(c3Cl)S(=O)(=O)NC3(CCOCC3)C(=O)N3CCN(CC3)C(=O)[C@@H](N)CCC[N+](C)(C)C)c2n1