Reaction Details
TargetB2 bradykinin receptor
LigandBDBM50419901
Substrate/Competitorn/a
Meas. Tech.ChEMBL_806222 (CHEMBL1958763)
Kd 0.794±n/a nM
Citation Fincham, CIBressan, AD'Andrea, PEttorre, AGiuliani, SMauro, SMeini, SParis, MQuartara, LRossi, CSquarcia, AValenti, CDaniela, FMaggi, CA Design and synthesis of novel sulfonamide-containing bradykinin hB(2) receptor antagonists. Synthesis and structure-relationships ofa,a-tetrahydropyranylglycine. Bioorg Med Chem20:2091-100 (2012) 
 
B2 bradykinin receptor
Name:B2 bradykinin receptor
Type:Enzyme Catalytic Domain
Mol. Mass.:44467.17
Organism:Homo sapiens (Human)
Description:B2 BRADYKININ BDKRB2 HUMAN::P30411
Residue:391
BDBM50419901
NameBDBM50419901
Synonyms:CHEMBL1956720
TypeSmall organic molecule
Emp. Form.C33H42Cl2N5O6S
Mol. Mass.707.687
SMILESCc1cc(C)c2cccc(OCc3c(Cl)ccc(c3Cl)S(=O)(=O)NC3(CCOCC3)C(=O)N3CCN(CC3)C(=O)C[N+](C)(C)C)c2n1