Reaction Details
TargetB2 bradykinin receptor
LigandBDBM50419905
Substrate/Competitorn/a
Meas. Tech.ChEMBL_806222 (CHEMBL1958763)
Kd 0.437±n/a nM
Citation Fincham, CIBressan, AD'Andrea, PEttorre, AGiuliani, SMauro, SMeini, SParis, MQuartara, LRossi, CSquarcia, AValenti, CDaniela, FMaggi, CA Design and synthesis of novel sulfonamide-containing bradykinin hB(2) receptor antagonists. Synthesis and structure-relationships ofa,a-tetrahydropyranylglycine. Bioorg Med Chem20:2091-100 (2012) 
 
B2 bradykinin receptor
Name:B2 bradykinin receptor
Type:Enzyme Catalytic Domain
Mol. Mass.:44467.17
Organism:Homo sapiens (Human)
Description:B2 BRADYKININ BDKRB2 HUMAN::P30411
Residue:391
BDBM50419905
NameBDBM50419905
Synonyms:CHEMBL1956853
TypeSmall organic molecule
Emp. Form.C35H45Cl2N5O6S
Mol. Mass.734.733
SMILESCN(C)CCCCC(=O)N1CCN(CC1)C(=O)C1(CCOCC1)NS(=O)(=O)c1ccc(Cl)c(COc2cccc3c(C)cc(C)nc23)c1Cl