Reaction Details
TargetB2 bradykinin receptor
LigandBDBM50419912
Substrate/Competitorn/a
Meas. Tech.ChEMBL_806222 (CHEMBL1958763)
Kd 1±n/a nM
Citation Fincham, CIBressan, AD'Andrea, PEttorre, AGiuliani, SMauro, SMeini, SParis, MQuartara, LRossi, CSquarcia, AValenti, CDaniela, FMaggi, CA Design and synthesis of novel sulfonamide-containing bradykinin hB(2) receptor antagonists. Synthesis and structure-relationships ofa,a-tetrahydropyranylglycine. Bioorg Med Chem20:2091-100 (2012) 
 
B2 bradykinin receptor
Name:B2 bradykinin receptor
Type:Enzyme Catalytic Domain
Mol. Mass.:44467.17
Organism:Homo sapiens (Human)
Description:B2 BRADYKININ BDKRB2 HUMAN::P30411
Residue:391
BDBM50419912
NameBDBM50419912
Synonyms:CHEMBL1956861
TypeSmall organic molecule
Emp. Form.C35H49Cl2N5O5S
Mol. Mass.722.764
SMILESCc1cc(C)c2cccc(OCc3c(Cl)ccc(c3Cl)S(=O)(=O)NC3(CCOCC3)C(=O)N3CC[N+](C)(CCC[N+](C)(C)C)CC3)c2n1