Reaction Details
TargetSolute carrier organic anion transporter family member 1A1
LigandBDBM50367247
Substrate/Competitorn/a
Meas. Tech.ChEMBL_839191 (CHEMBL2077862)
Ki 76700±n/a nM
Citation Shitara, YSugiyama, DKusuhara, HKato, YAbe, TMeier, PJItoh, TSugiyama, Y Comparative inhibitory effects of different compounds on rat oatpl (slc21a1)- and Oatp2 (Slc21a5)-mediated transport. Pharm Res19:147-53 (2002) Solute carrier organic anion transporter family member 1A1
Name:Solute carrier organic anion transporter family member 1A1
Type:PROTEIN
Mol. Mass.:74188.94
Organism:Rattus norvegicus
Description:ChEMBL_838286
Residue:670
BDBM50367247
NameBDBM50367247
Synonyms:QUININE Quinsan | cid_3034034
TypeSmall organic molecule
Emp. Form.C20H24N2O2
Mol. Mass.324.4168
SMILESCOc1ccc2nccc([C@@H](O)[C@@H]3C[C@@H]4CCN3C[C@@H]4C=C)c2c1