Reaction Details
TargetSolute carrier organic anion transporter family member 1A4
LigandBDBM50370232
Substrate/Competitorn/a
Meas. Tech.ChEMBL_838985 (CHEMBL2078502)
Ki 1460±n/a nM
Citation Shitara, YSugiyama, DKusuhara, HKato, YAbe, TMeier, PJItoh, TSugiyama, Y Comparative inhibitory effects of different compounds on rat oatpl (slc21a1)- and Oatp2 (Slc21a5)-mediated transport. Pharm Res19:147-53 (2002) Solute carrier organic anion transporter family member 1A4
Name:Solute carrier organic anion transporter family member 1A4
Type:PROTEIN
Mol. Mass.:73261.82
Organism:Rattus norvegicus
Description:ChEMBL_836631
Residue:661
BDBM50370232
NameBDBM50370232
Synonyms:BA-41166E RIFAMPIN Rifampicin
TypeSmall organic molecule
Emp. Form.C43H58N4O12
Mol. Mass.822.9402
SMILESCO[C@H]1\C=C\O[C@@]2(C)Oc3c(C2=O)c2c(O)c(\C=N\N4CCN(C)CC4)c(NC(=O)\C(C)=C/C=C/[C@H](C)[C@H](O)[C@@H](C)[C@@H](O)[C@@H](C)[C@H](OC(C)=O)[C@@H]1C)c(O)c2c(O)c3C