Reaction Details
TargetSolute carrier family 22 member 11
LigandBDBM50206509
Substrate/Competitorn/a
Meas. Tech.ChEMBL_836434 (CHEMBL2076874)
Ki 54900±n/a nM
Citation Enomoto, ATakeda, MShimoda, MNarikawa, SKobayashi, YKobayashi, YYamamoto, TSekine, TCha, SHNiwa, TEndou, H Interaction of human organic anion transporters 2 and 4 with organic anion transport inhibitors. J Pharmacol Exp Ther301:797-802 (2002) Solute carrier family 22 member 11
Name:Solute carrier family 22 member 11
Type:PROTEIN
Mol. Mass.:59982.54
Organism:Homo sapiens (Human)
Description:ChEMBL_838708
Residue:550
BDBM50206509
NameBDBM50206509
Synonyms:4-Dipropylsulfamoyl-benzoic acid 4-Dipropylsulfamoyl-benzoic acid(probenecid) CHEMBL897 Probalan
TypeSmall organic molecule
Emp. Form.C13H19NO4S
Mol. Mass.285.359
SMILESCCCN(CCC)S(=O)(=O)c1ccc(cc1)C(O)=O