Reaction Details
TargetIleal sodium/bile acid cotransporter
LigandBDBM50375594
Substrate/Competitorn/a
Meas. Tech.ChEMBL_838471 (CHEMBL2076042)
Ki 41500±n/a nM
Citation Craddock, ALLove, MWDaniel, RWKirby, LCWalters, HCWong, MHDawson, PA Expression and transport properties of the human ileal and renal sodium-dependent bile acid transporter. Am J Physiol274:157-69 (1998) 
 
Ileal sodium/bile acid cotransporter
Name:Ileal sodium/bile acid cotransporter
Type:Enzyme
Mol. Mass.:37714.89
Organism:Homo sapiens (Human)
Description:SLC10A2
Residue:348
BDBM50375594
NameBDBM50375594
Synonyms:TAUROCHOLATE
TypeSmall organic molecule
Emp. Form.C26H45NO7S
Mol. Mass.515.703
SMILESC[C@H](CCC(=O)NCCS(O)(=O)=O)[C@H]1CC[C@H]2[C@@H]3[C@H](O)C[C@@H]4C[C@H](O)CC[C@]4(C)[C@H]3C[C@H](O)[C@]12C