Reaction Details
TargetSolute carrier family 22 member 6
LigandBDBM50420189
Substrate/Competitorn/a
Meas. Tech.ChEMBL_837480 (CHEMBL2075968)
Ki 100000±n/a nM
Citation Koh, ASSimmons-Willis, TAPritchard, JBGrassl, SMBallatori, N Identification of a mechanism by which the methylmercury antidotes N-acetylcysteine and dimercaptopropanesulfonate enhance urinary metal excretion: transport by the renal organic anion transporter-1. Mol Pharmacol62:921-6 (2002) Solute carrier family 22 member 6
Name:Solute carrier family 22 member 6
Type:PROTEIN
Mol. Mass.:60784.17
Organism:Rattus norvegicus
Description:ChEMBL_838479
Residue:551
BDBM50420189
NameBDBM50420189
Synonyms:CHEMBL1624767
TypeSmall organic molecule
Emp. Form.C3H8O3S3
Mol. Mass.188.289
SMILESOS(=O)(=O)CC(S)CS