Reaction Details
TargetSolute carrier family 22 member 6
LigandBDBM50420190
Substrate/Competitorn/a
Meas. Tech.ChEMBL_837480 (CHEMBL2075968)
Ki 2000000±n/a nM
Citation Koh, ASSimmons-Willis, TAPritchard, JBGrassl, SMBallatori, N Identification of a mechanism by which the methylmercury antidotes N-acetylcysteine and dimercaptopropanesulfonate enhance urinary metal excretion: transport by the renal organic anion transporter-1. Mol Pharmacol62:921-6 (2002) Solute carrier family 22 member 6
Name:Solute carrier family 22 member 6
Type:PROTEIN
Mol. Mass.:60784.17
Organism:Rattus norvegicus
Description:ChEMBL_838479
Residue:551
BDBM50420190
NameBDBM50420190
Synonyms:5052 | ACETYLCYSTEINE
TypeSmall organic molecule
Emp. Form.C5H9NO3S
Mol. Mass.163.195
SMILESCC(=O)N[C@@H](CS)C(O)=O