Reaction Details
TargetSolute carrier family 22 member 6
LigandBDBM17638
Substrate/Competitorn/a
Meas. Tech.ChEMBL_838299 (CHEMBL2076247)
IC50 3000±n/a nM
Citation Mulato, ASHo, ESCihlar, T Nonsteroidal anti-inflammatory drugs efficiently reduce the transport and cytotoxicity of adefovir mediated by the human renal organic anion transporter 1. J Pharmacol Exp Ther295:10-5 (2000) Solute carrier family 22 member 6
Name:Solute carrier family 22 member 6
Type:PROTEIN
Mol. Mass.:61831.78
Organism:Homo sapiens (Human)
Description:ChEMBL_1487359
Residue:563
BDBM17638
NameBDBM17638
Synonyms:2-{1-[(4-chlorophenyl)carbonyl]-5-methoxy-2-methyl-1H-indol-3-yl}acetic acid Indocin US11478464, Compound Indomethacin US9271961, Indomethacin | indometacin
TypeSmall organic molecule
Emp. Form.C19H16ClNO4
Mol. Mass.357.788
SMILESCOc1ccc2n(C(=O)c3ccc(Cl)cc3)c(C)c(CC(O)=O)c2c1