Reaction Details
TargetSolute carrier family 22 member 2
LigandBDBM50403559
Substrate/Competitorn/a
Meas. Tech.ChEMBL_836433 (CHEMBL2076873)
Ki 198000±n/a nM
Citation Pan, BFSweet, DHPritchard, JBChen, RNelson, JA A transfected cell model for the renal toxin transporter, rOCT2. Toxicol Sci47:181-6 (1999) Solute carrier family 22 member 2
Name:Solute carrier family 22 member 2
Type:Enzyme Catalytic Domain
Mol. Mass.:62348.38
Organism:RAT
Description:Adrenaline alpha2 0 RAT::Q9R0W2
Residue:555
BDBM50403559
NameBDBM50403559
Synonyms:Brumetadina | CIMETIDINE
TypeSmall organic molecule
Emp. Form.C10H16N6S
Mol. Mass.252.339
SMILESCNC(NCCSCc1[nH]cnc1C)=NC#N