Reaction Details
TargetSolute carrier organic anion transporter family member 1B1
LigandBDBM50406681
Substrate/Competitorn/a
Meas. Tech.ChEMBL_838505 (CHEMBL2078133)
IC50 4000±n/a nM
Citation Chen, CMireles, RJCampbell, SDLin, JMills, JBXu, JJSmolarek, TA Differential interaction of 3-hydroxy-3-methylglutaryl-coa reductase inhibitors with ABCB1, ABCC2, and OATP1B1. Drug Metab Dispos33:537-46 (2005) 
 
Solute carrier organic anion transporter family member 1B1
Name:Solute carrier organic anion transporter family member 1B1
Type:Protein
Mol. Mass.:76468.06
Organism:Homo sapiens (Human)
Description:Q9Y6L6
Residue:691
BDBM50406681
NameBDBM50406681
Synonyms:MEVINOLINIC ACID
TypeSmall organic molecule
Emp. Form.C24H38O6
Mol. Mass.422.5549
SMILESCC[C@H](C)C(=O)O[C@H]1C[C@@H](C)C=C2C=C[C@H](C)[C@H](CC[C@@H](O)C[C@@H](O)CC(O)=O)[C@@H]12