Reaction Details
TargetATP-dependent translocase ABCB1
LigandBDBM50012278
Substrate/Competitorn/a
Meas. Tech.ChEMBL_838520 (CHEMBL2078148)
IC50 29000±n/a nM
Citation Chen, CMireles, RJCampbell, SDLin, JMills, JBXu, JJSmolarek, TA Differential interaction of 3-hydroxy-3-methylglutaryl-coa reductase inhibitors with ABCB1, ABCC2, and OATP1B1. Drug Metab Dispos33:537-46 (2005) 
 
ATP-dependent translocase ABCB1
Name:ATP-dependent translocase ABCB1
Type:Protein
Mol. Mass.:141503.50
Organism:Homo sapiens (Human)
Description:P08183
Residue:1280
BDBM50012278
NameBDBM50012278
Synonyms:(2ALPHA,2''BETA,3BETA,4ALPHA,5BETA)-VINCALEUKOBLASTINE VINBLASTINE cid_5388983
TypeSmall organic molecule
Emp. Form.C46H58N4O9
Mol. Mass.810.9741
SMILESCC[C@]1(O)C[C@@H]2CN(C1)CCc1c([nH]c3ccccc13)[C@@](C2)(C(=O)OC)c1cc2c(cc1OC)N(C)[C@@H]1[C@]22CCN3CC=C[C@](CC)([C@@H]23)[C@@H](OC(C)=O)[C@]1(O)C(=O)OC