Reaction Details
TargetATP-dependent translocase ABCB1
LigandBDBM50011032
Substrate/Competitorn/a
Meas. Tech.ChEMBL_838520 (CHEMBL2078148)
IC50 14000±n/a nM
Citation Chen, CMireles, RJCampbell, SDLin, JMills, JBXu, JJSmolarek, TA Differential interaction of 3-hydroxy-3-methylglutaryl-coa reductase inhibitors with ABCB1, ABCC2, and OATP1B1. Drug Metab Dispos33:537-46 (2005) 
 
ATP-dependent translocase ABCB1
Name:ATP-dependent translocase ABCB1
Type:Protein
Mol. Mass.:141503.50
Organism:Homo sapiens (Human)
Description:P08183
Residue:1280
BDBM50011032
NameBDBM50011032
Synonyms:5-(4-Fluoro-phenyl)-1-[2-(4-hydroxy-6-oxo-tetrahydro-pyran-2-yl)-ethyl]-2-isopropyl-4-phenyl-1H-pyrrole-3-carboxylic acid phenylamide CHEMBL333687 | US9006282, Example 3, Compound 2
TypeSmall organic molecule
Emp. Form.C33H33FN2O4
Mol. Mass.540.6245
SMILESCC(C)c1c(C(=O)Nc2ccccc2)c(c(-c2ccc(F)cc2)n1CC[C@@H]1C[C@@H](O)CC(=O)O1)-c1ccccc1