Reaction Details
TargetSolute carrier organic anion transporter family member 1B1
LigandBDBM50391000
Substrate/Competitorn/a
Meas. Tech.ChEMBL_838505 (CHEMBL2078133)
IC50 230±n/a nM
Citation Chen, CMireles, RJCampbell, SDLin, JMills, JBXu, JJSmolarek, TA Differential interaction of 3-hydroxy-3-methylglutaryl-coa reductase inhibitors with ABCB1, ABCC2, and OATP1B1. Drug Metab Dispos33:537-46 (2005) 
 
Solute carrier organic anion transporter family member 1B1
Name:Solute carrier organic anion transporter family member 1B1
Type:Protein
Mol. Mass.:76468.06
Organism:Homo sapiens (Human)
Description:Q9Y6L6
Residue:691
BDBM50391000
NameBDBM50391000
Synonyms:CB-01-11 | RIFAMYCIN
TypeSmall organic molecule
Emp. Form.C37H47NO12
Mol. Mass.697.7686
SMILESCO[C@H]1\C=C\O[C@@]2(C)Oc3c(C2=O)c2c(O)cc(NC(=O)\C(C)=C/C=C/[C@H](C)[C@H](O)[C@@H](C)[C@@H](O)[C@@H](C)[C@H](OC(C)=O)[C@@H]1C)c(O)c2c(O)c3C