Reaction Details
TargetSolute carrier organic anion transporter family member 1B1
LigandBDBM50139181
Substrate/Competitorn/a
Meas. Tech.ChEMBL_838505 (CHEMBL2078133)
IC50 9700±n/a nM
Citation Chen, CMireles, RJCampbell, SDLin, JMills, JBXu, JJSmolarek, TA Differential interaction of 3-hydroxy-3-methylglutaryl-coa reductase inhibitors with ABCB1, ABCC2, and OATP1B1. Drug Metab Dispos33:537-46 (2005) 
 
Solute carrier organic anion transporter family member 1B1
Name:Solute carrier organic anion transporter family member 1B1
Type:Protein
Mol. Mass.:76468.06
Organism:Homo sapiens (Human)
Description:Q9Y6L6
Residue:691
BDBM50139181
NameBDBM50139181
Synonyms:(1S,3R,7S,8S,8aR)-8-{2-[(2R,4R)-4-hydroxy-6-oxotetrahydro-2H-pyran-2-yl]ethyl}-3,7-dimethyl-1,2,3,7,8,8a-hexahydronaphthalen-1-yl 2,2-dimethylbutanoate MK-733 Simvastatin cid_54454
TypeSmall organic molecule
Emp. Form.C25H38O5
Mol. Mass.418.5662
SMILESCCC(C)(C)C(=O)O[C@H]1C[C@@H](C)C=C2C=C[C@H](C)[C@H](CC[C@@H]3C[C@@H](O)CC(=O)O3)[C@@H]12