Reaction Details
TargetBile salt export pump
LigandBDBM50012957
Substrate/Competitorn/a
Meas. Tech.ChEMBL_837474 (CHEMBL2075962)
IC50 8600±n/a nM
Citation Funk, CPantze, MJehle, LPonelle, CScheuermann, GLazendic, MGasser, R Troglitazone-induced intrahepatic cholestasis by an interference with the hepatobiliary export of bile acids in male and female rats. Correlation with the gender difference in troglitazone sulfate formation and the inhibition of the canalicular bile salt export pump (Bsep) by troglitazone and trogl Toxicology167:83-98 (2001) Bile salt export pump
Name:Bile salt export pump
Type:PROTEIN
Mol. Mass.:146267.86
Organism:Rattus norvegicus
Description:ChEMBL_1481883
Residue:1321
BDBM50012957
NameBDBM50012957
Synonyms:1-((p-(2-(5-chloro-o-anisamido)ethyl)phenyl)sulfonyl)-3-cyclohexylurea 5-chloro-N-(2-(4-((((cyclohexylamino)carbonyl)amino)sulfonyl)phenyl)ethyl)-2-methoxybenzamide CHEMBL472 Glibenclamide | US20230348371, Compound 5
TypeSmall organic molecule
Emp. Form.C23H28ClN3O5S
Mol. Mass.494.004
SMILESCOc1ccc(Cl)cc1C(=O)NCCc1ccc(cc1)S(=O)(=O)NC(=O)NC1CCCCC1