Reaction Details
TargetATP-dependent translocase ABCB1
LigandBDBM50338982
Substrate/Competitorn/a
Meas. Tech.ChEMBL_838301 (CHEMBL2076249)
IC50 400±n/a nM
Citation Choi, CHKim, JHKim, SH Reversal of P-glycoprotein-mediated MDR by 5,7,3',4',5'-pentamethoxyflavone and SAR. Biochem Biophys Res Commun320:672-9 (2004) 
 
ATP-dependent translocase ABCB1
Name:ATP-dependent translocase ABCB1
Type:Protein
Mol. Mass.:141503.50
Organism:Homo sapiens (Human)
Description:P08183
Residue:1280
BDBM50338982
NameBDBM50338982
Synonyms:(R)-5-((3,4-dimethoxyphenethyl)(methyl)amino)-2-(3,4-dimethoxyphenyl)-2-isopropylpentanenitrile (S)-2-(3,4-Dimethoxy-phenyl)-5-{[2-(3,4-dimethoxy-phenyl)-ethyl]-methyl-amino}-2-isopropyl-pentanenitrile; hydrochloride (Verapamil) 2-(3,4-Dimethoxy-phenyl)-5-{[2-(3,4-dimethoxy-phenyl)-ethyl]-methyl-amino}-2-isopropyl-pentanenitrile 2-(3,4-dimethoxy-phenyl)-5-{[2-(3,4-dimethoxy-phenyl)-ethyl]-methyl-amino}-2-isopropyl-pentanenitrile 5-((3,4-dimethoxyphenethyl)(methyl)amino)-2-(3,4-dimethoxyphenyl)-2-isopropylpentanenitrile 5-{[2-(3,4-Dimethoxy-phenyl)-ethyl]-methyl-amino}-2-isopropyl-2-(4-methoxy-phenyl)-pentanenitrile Calan Covera-HS Iproveratril Isoptin SR VERAPAMIL Verapramil verapamil-R
TypeSmall organic molecule
Emp. Form.C27H38N2O4
Mol. Mass.454.6016
SMILESCOc1ccc(CCN(C)CCC[C@@](C#N)(C(C)C)c2ccc(OC)c(OC)c2)cc1OC