Reaction Details
TargetATP-dependent translocase ABCB1
LigandBDBM50420211
Substrate/Competitorn/a
Meas. Tech.ChEMBL_838301 (CHEMBL2076249)
IC50 1400±n/a nM
Citation Choi, CHKim, JHKim, SH Reversal of P-glycoprotein-mediated MDR by 5,7,3',4',5'-pentamethoxyflavone and SAR. Biochem Biophys Res Commun320:672-9 (2004) 
 
ATP-dependent translocase ABCB1
Name:ATP-dependent translocase ABCB1
Type:Protein
Mol. Mass.:141503.50
Organism:Homo sapiens (Human)
Description:P08183
Residue:1280
BDBM50420211
NameBDBM50420211
Synonyms:TRIMETHYLAPIGENIN
TypeSmall organic molecule
Emp. Form.C18H16O5
Mol. Mass.312.3166
SMILESCOc1ccc(cc1)-c1cc(=O)c2c(OC)cc(OC)cc2o1