Reaction Details
TargetATP-dependent translocase ABCB1
LigandBDBM50420213
Substrate/Competitorn/a
Meas. Tech.ChEMBL_838301 (CHEMBL2076249)
IC50 6300±n/a nM
Citation Choi, CHKim, JHKim, SH Reversal of P-glycoprotein-mediated MDR by 5,7,3',4',5'-pentamethoxyflavone and SAR. Biochem Biophys Res Commun320:672-9 (2004) 
 
ATP-dependent translocase ABCB1
Name:ATP-dependent translocase ABCB1
Type:Protein
Mol. Mass.:141503.50
Organism:Homo sapiens (Human)
Description:P08183
Residue:1280
BDBM50420213
NameBDBM50420213
Synonyms:CHEMBL575072
TypeSmall organic molecule
Emp. Form.C17H14O6
Mol. Mass.314.2895
SMILESCOc1ccc(cc1OC)-c1oc2cc(O)ccc2c(=O)c1O