Reaction Details
TargetSolute carrier family 22 member 2
LigandBDBM50420215
Substrate/Competitorn/a
Meas. Tech.ChEMBL_836776 (CHEMBL2075301)
Ki 13±n/a nM
Citation Gründemann, DKöster, SKiefer, NBreidert, TEngelhardt, MSpitzenberger, FObermüller, NSchömig, E Transport of monoamine transmitters by the organic cation transporter type 2, OCT2. J Biol Chem273:30915-20 (1998) Solute carrier family 22 member 2
Name:Solute carrier family 22 member 2
Type:Enzyme Catalytic Domain
Mol. Mass.:62348.38
Organism:RAT
Description:Adrenaline alpha2 0 RAT::Q9R0W2
Residue:555
BDBM50420215
NameBDBM50420215
Synonyms:CHEMBL339858
TypeSmall organic molecule
Emp. Form.C25H27N2
Mol. Mass.355.4947
SMILESCC(C)N1\C(=C/c2cc[n+](C(C)C)c3ccccc23)C=Cc2ccccc12