Reaction Details
TargetSolute carrier family 22 member 2
LigandBDBM7966
Substrate/Competitorn/a
Meas. Tech.ChEMBL_836777 (CHEMBL2075302)
Ki 390000±n/a nM
Citation Gründemann, DLiebich, GKiefer, NKöster, SSchömig, E Selective substrates for non-neuronal monoamine transporters. Mol Pharmacol56:1-10 (1999) Solute carrier family 22 member 2
Name:Solute carrier family 22 member 2
Type:Enzyme Catalytic Domain
Mol. Mass.:62348.38
Organism:RAT
Description:Adrenaline alpha2 0 RAT::Q9R0W2
Residue:555
BDBM7966
NameBDBM7966
Synonyms:2-(1H-imidazol-4-yl)ethan-1-amine CHEMBL90 Ergotidine Histamine Peremin | [3H]histamine
TypeSmall organic molecule
Emp. Form.C5H9N3
Mol. Mass.111.1451
SMILESNCCc1cnc[nH]1