Reaction Details
TargetSolute carrier family 22 member 1
LigandBDBM50420217
Substrate/Competitorn/a
Meas. Tech.ChEMBL_838296 (CHEMBL2076244)
Ki 43000±n/a nM
Citation Gründemann, DGorboulev, VGambaryan, SVeyhl, MKoepsell, H Drug excretion mediated by a new prototype of polyspecific transporter. Nature372:549-552 (1994) 
 
Solute carrier family 22 member 1
Name:Solute carrier family 22 member 1
Type:Enzyme Catalytic Domain
Mol. Mass.:61538.40
Organism:RAT
Description:Adrenaline alpha1 0 RAT::Q63089
Residue:556
BDBM50420217
NameBDBM50420217
Synonyms:METIPRENALINE
TypeSmall organic molecule
Emp. Form.C12H19NO3
Mol. Mass.225.2842
SMILESCOc1cc(ccc1O)C(O)CNC(C)C