Reaction Details
TargetSolute carrier family 22 member 1
LigandBDBM50367247
Substrate/Competitorn/a
Meas. Tech.ChEMBL_838296 (CHEMBL2076244)
Ki 930±n/a nM
Citation Gründemann, DGorboulev, VGambaryan, SVeyhl, MKoepsell, H Drug excretion mediated by a new prototype of polyspecific transporter. Nature372:549-552 (1994) 
 
Solute carrier family 22 member 1
Name:Solute carrier family 22 member 1
Type:Enzyme Catalytic Domain
Mol. Mass.:61538.40
Organism:RAT
Description:Adrenaline alpha1 0 RAT::Q63089
Residue:556
BDBM50367247
NameBDBM50367247
Synonyms:QUININE Quinsan | cid_3034034
TypeSmall organic molecule
Emp. Form.C20H24N2O2
Mol. Mass.324.4168
SMILESCOc1ccc2nccc([C@@H](O)[C@@H]3C[C@@H]4CCN3C[C@@H]4C=C)c2c1