Reaction Details
TargetSolute carrier organic anion transporter family member 1A1
LigandBDBM50206509
Substrate/Competitorn/a
Meas. Tech.ChEMBL_837109 (CHEMBL2076361)
Ki 74400±n/a nM
Citation Sugiyama, DKusuhara, HShitara, YAbe, TMeier, PJSekine, TEndou, HSuzuki, HSugiyama, Y Characterization of the efflux transport of 17beta-estradiol-D-17beta-glucuronide from the brain across the blood-brain barrier. J Pharmacol Exp Ther298:316-22 (2001) Solute carrier organic anion transporter family member 1A1
Name:Solute carrier organic anion transporter family member 1A1
Type:PROTEIN
Mol. Mass.:74188.94
Organism:Rattus norvegicus
Description:ChEMBL_838286
Residue:670
BDBM50206509
NameBDBM50206509
Synonyms:4-Dipropylsulfamoyl-benzoic acid 4-Dipropylsulfamoyl-benzoic acid(probenecid) CHEMBL897 Probalan
TypeSmall organic molecule
Emp. Form.C13H19NO4S
Mol. Mass.285.359
SMILESCCCN(CCC)S(=O)(=O)c1ccc(cc1)C(O)=O