Reaction Details
TargetSolute carrier organic anion transporter family member 1A4
LigandBDBM46355
Substrate/Competitorn/a
Meas. Tech.ChEMBL_836631 (CHEMBL2077473)
Ki 37±n/a nM
Citation Sugiyama, DKusuhara, HShitara, YAbe, TMeier, PJSekine, TEndou, HSuzuki, HSugiyama, Y Characterization of the efflux transport of 17beta-estradiol-D-17beta-glucuronide from the brain across the blood-brain barrier. J Pharmacol Exp Ther298:316-22 (2001) Solute carrier organic anion transporter family member 1A4
Name:Solute carrier organic anion transporter family member 1A4
Type:PROTEIN
Mol. Mass.:73261.82
Organism:Rattus norvegicus
Description:ChEMBL_836631
Residue:661
BDBM46355
NameBDBM46355
Synonyms:DIGOXIN SMR000059217 cid_2724385
TypeSmall organic molecule
Emp. Form.C41H64O14
Mol. Mass.780.9385
SMILESC[C@H]1O[C@H](C[C@H](O)[C@@H]1O)O[C@H]1[C@@H](O)C[C@H](O[C@H]2[C@@H](O)C[C@H](O[C@H]3CC[C@@]4(C)[C@H](CC[C@@H]5[C@@H]4C[C@@H](O)[C@]4(C)[C@H](CC[C@]54O)C4=CC(=O)OC4)C3)O[C@@H]2C)O[C@@H]1C