Reaction Details
TargetSolute carrier organic anion transporter family member 1A4
LigandBDBM50375594
Substrate/Competitorn/a
Meas. Tech.ChEMBL_836631 (CHEMBL2077473)
Ki 39400±n/a nM
Citation Sugiyama, DKusuhara, HShitara, YAbe, TMeier, PJSekine, TEndou, HSuzuki, HSugiyama, Y Characterization of the efflux transport of 17beta-estradiol-D-17beta-glucuronide from the brain across the blood-brain barrier. J Pharmacol Exp Ther298:316-22 (2001) Solute carrier organic anion transporter family member 1A4
Name:Solute carrier organic anion transporter family member 1A4
Type:PROTEIN
Mol. Mass.:73261.82
Organism:Rattus norvegicus
Description:ChEMBL_836631
Residue:661
BDBM50375594
NameBDBM50375594
Synonyms:TAUROCHOLATE
TypeSmall organic molecule
Emp. Form.C26H45NO7S
Mol. Mass.515.703
SMILESC[C@H](CCC(=O)NCCS(O)(=O)=O)[C@H]1CC[C@H]2[C@@H]3[C@H](O)C[C@@H]4C[C@H](O)CC[C@]4(C)[C@H]3C[C@H](O)[C@]12C