Reaction Details
TargetSolute carrier family 22 member 6
LigandBDBM50206509
Substrate/Competitorn/a
Meas. Tech.ChEMBL_837482 (CHEMBL2075970)
Ki 31000±n/a nM
Citation Sugiyama, DKusuhara, HShitara, YAbe, TMeier, PJSekine, TEndou, HSuzuki, HSugiyama, Y Characterization of the efflux transport of 17beta-estradiol-D-17beta-glucuronide from the brain across the blood-brain barrier. J Pharmacol Exp Ther298:316-22 (2001) Solute carrier family 22 member 6
Name:Solute carrier family 22 member 6
Type:PROTEIN
Mol. Mass.:60784.17
Organism:Rattus norvegicus
Description:ChEMBL_838479
Residue:551
BDBM50206509
NameBDBM50206509
Synonyms:4-Dipropylsulfamoyl-benzoic acid 4-Dipropylsulfamoyl-benzoic acid(probenecid) CHEMBL897 Probalan
TypeSmall organic molecule
Emp. Form.C13H19NO4S
Mol. Mass.285.359
SMILESCCCN(CCC)S(=O)(=O)c1ccc(cc1)C(O)=O