Reaction Details
TargetABC-type glutathione-S-conjugate transporter
LigandBDBM50375594
Substrate/Competitorn/a
Meas. Tech.ChEMBL_837732 (CHEMBL2076987)
IC50 40000±n/a nM
Citation Zhang, DWGu, HMVasa, MMuredda, MCole, SPDeeley, RG Characterization of the role of polar amino acid residues within predicted transmembrane helix 17 in determining the substrate specificity of multidrug resistance protein 3. Biochemistry42:9989-10000 (2003) 
 
ABC-type glutathione-S-conjugate transporter
Name:ABC-type glutathione-S-conjugate transporter
Type:PROTEIN
Mol. Mass.:167836.19
Organism:Homo sapiens (Human)
Description:ChEMBL_837732
Residue:1514
BDBM50375594
NameBDBM50375594
Synonyms:TAUROCHOLATE
TypeSmall organic molecule
Emp. Form.C26H45NO7S
Mol. Mass.515.703
SMILESC[C@H](CCC(=O)NCCS(O)(=O)=O)[C@H]1CC[C@H]2[C@@H]3[C@H](O)C[C@@H]4C[C@H](O)CC[C@]4(C)[C@H]3C[C@H](O)[C@]12C