Reaction Details
TargetBile salt export pump
LigandBDBM50012957
Substrate/Competitorn/a
Meas. Tech.ChEMBL_838278 (CHEMBL2076226)
IC50 146500±n/a nM
Citation Wang, EJCasciano, CNClement, RPJohnson, WW Fluorescent substrates of sister-P-glycoprotein (BSEP) evaluated as markers of active transport and inhibition: evidence for contingent unequal binding sites. Pharm Res20:537-44 (2003) Bile salt export pump
Name:Bile salt export pump
Type:Protein
Mol. Mass.:146405.49
Organism:Homo sapiens (Human)
Description:O95342
Residue:1321
BDBM50012957
NameBDBM50012957
Synonyms:1-((p-(2-(5-chloro-o-anisamido)ethyl)phenyl)sulfonyl)-3-cyclohexylurea 5-chloro-N-(2-(4-((((cyclohexylamino)carbonyl)amino)sulfonyl)phenyl)ethyl)-2-methoxybenzamide CHEMBL472 Glibenclamide | US20230348371, Compound 5
TypeSmall organic molecule
Emp. Form.C23H28ClN3O5S
Mol. Mass.494.004
SMILESCOc1ccc(Cl)cc1C(=O)NCCc1ccc(cc1)S(=O)(=O)NC(=O)NC1CCCCC1