Reaction Details
TargetSolute carrier family 22 member 1
LigandBDBM50420217
Substrate/Competitorn/a
Meas. Tech.ChEMBL_838515 (CHEMBL2078143)
Ki 25000±n/a nM
Citation Martel, FVetter, TRuss, HGründemann, DAzevedo, IKoepsell, HSchömig, E Transport of small organic cations in the rat liver. The role of the organic cation transporter OCT1. Naunyn Schmiedebergs Arch Pharmacol354:320-6 (1997) 
 
Solute carrier family 22 member 1
Name:Solute carrier family 22 member 1
Type:Enzyme Catalytic Domain
Mol. Mass.:61538.40
Organism:RAT
Description:Adrenaline alpha1 0 RAT::Q63089
Residue:556
BDBM50420217
NameBDBM50420217
Synonyms:METIPRENALINE
TypeSmall organic molecule
Emp. Form.C12H19NO3
Mol. Mass.225.2842
SMILESCOc1cc(ccc1O)C(O)CNC(C)C