Reaction Details
TargetATP-binding cassette sub-family C member 2
LigandBDBM50420229
Substrate/Competitorn/a
Meas. Tech.ChEMBL_836947 (CHEMBL2075787)
IC50 120±n/a nM
Citation Jedlitschky, GLeier, IBuchholz, UHummel-Eisenbeiss, JBurchell, BKeppler, D ATP-dependent transport of bilirubin glucuronides by the multidrug resistance protein MRP1 and its hepatocyte canalicular isoform MRP2. Biochem J327:305-10 (1997) ATP-binding cassette sub-family C member 2
Name:ATP-binding cassette sub-family C member 2
Type:PROTEIN
Mol. Mass.:173415.22
Organism:Rattus norvegicus
Description:ChEMBL_1455464
Residue:1541
BDBM50420229
NameBDBM50420229
Synonyms:CHEMBL2074720
TypeSmall organic molecule
Emp. Form.C39H44N4O12
Mol. Mass.760.7863
SMILESCC1=C(C=C)\C(NC1=O)=C\c1[nH]c(Cc2[nH]c(\C=C3/NC(=O)C(C=C)=C3C)c(C)c2CCC(O)=O)c(CCC(=O)O[C@@H]2OC([C@@H](O)C(O)C2O)C(O)=O)c1C