Reaction Details
TargetMultidrug resistance-associated protein 1
LigandBDBM50001285
Substrate/Competitorn/a
Meas. Tech.ChEMBL_838238 (CHEMBL2075748)
Ki 600±n/a nM
Citation Jedlitschky, GLeier, IBuchholz, UBarnouin, KKurz, GKeppler, D Transport of glutathione, glucuronate, and sulfate conjugates by the MRP gene-encoded conjugate export pump. Cancer Res56:988-94 (1996) Multidrug resistance-associated protein 1
Name:Multidrug resistance-associated protein 1
Type:n/a
Mol. Mass.:171597.72
Organism:Homo sapiens (Human)
Description:P33527
Residue:1531
BDBM50001285
NameBDBM50001285
Synonyms:(E)-3-((3-(2-(7-chloroquinolin-2-yl)vinyl)phenyl)(3-(dimethylamino)-3-oxopropylthio)methylthio)propanoic acid 3-((3-(2-(7-chloroquinolin-2-yl)vinyl)phenyl)(3-(dimethylamino)-3-oxopropylthio)methylthio)propanoic acid 3-[{3-[(E)-2-(7-Chloro-quinolin-2-yl)-vinyl]-phenyl}-(2-dimethylcarbamoyl-ethylsulfanyl)-methylsulfanyl]-propionic acid 3-[{3-[2-(7-Chloro-quinolin-2-yl)-vinyl]-phenyl}-(2-dimethylcarbamoyl-ethylsulfanyl)-methylsulfanyl]-propionic acid(MK-571, L-660711) L-660711 MK-571
TypeSmall organic molecule
Emp. Form.C26H27ClN2O3S2
Mol. Mass.515.087
SMILESCN(C)C(=O)CCSC(SCCC(O)=O)c1cccc(\C=C\c2ccc3ccc(Cl)cc3n2)c1