Reaction Details
TargetSolute carrier family 22 member 1
LigandBDBM50420217
Substrate/Competitorn/a
Meas. Tech.ChEMBL_838699 (CHEMBL2078481)
IC50>100000±n/a nM
Citation Hayer-Zillgen, MBrüss, MBönisch, H Expression and pharmacological profile of the human organic cation transporters hOCT1, hOCT2 and hOCT3. Br J Pharmacol136:829-36 (2002) 
 
Solute carrier family 22 member 1
Name:Solute carrier family 22 member 1
Type:Enzyme Catalytic Domain
Mol. Mass.:61154.85
Organism:Homo sapiens (Human)
Description:Adrenergic Alpha 0 HUMAN::O15245
Residue:554
BDBM50420217
NameBDBM50420217
Synonyms:METIPRENALINE
TypeSmall organic molecule
Emp. Form.C12H19NO3
Mol. Mass.225.2842
SMILESCOc1cc(ccc1O)C(O)CNC(C)C