Reaction Details
TargetSolute carrier family 22 member 2
LigandBDBM50420217
Substrate/Competitorn/a
Meas. Tech.ChEMBL_838700 (CHEMBL2078482)
IC50>100000±n/a nM
Citation Hayer-Zillgen, MBrüss, MBönisch, H Expression and pharmacological profile of the human organic cation transporters hOCT1, hOCT2 and hOCT3. Br J Pharmacol136:829-36 (2002) 
 
Solute carrier family 22 member 2
Name:Solute carrier family 22 member 2
Type:PROTEIN
Mol. Mass.:62591.01
Organism:Homo sapiens (Human)
Description:ChEMBL_1484077
Residue:555
BDBM50420217
NameBDBM50420217
Synonyms:METIPRENALINE
TypeSmall organic molecule
Emp. Form.C12H19NO3
Mol. Mass.225.2842
SMILESCOc1cc(ccc1O)C(O)CNC(C)C